{"text_format":"1","workbook":"xlsx","n_sheets":8,"sheets":["Anleitung","Ansprechpartner-Meldung","Einzel-Meldung","Mannschaft-Meldung","LineThrow-Meldung","KR-Meldung","Listen","Historie"],"not_rendered":{"charts":0,"images":1,"macros":1,"external_links":0,"defined_names":19,"comments":5,"pivot_tables":0},"unopened":[],"bounds":{"document_bytes":16777216,"sheet_cells":100000,"rows_first":2000,"rows_last":500,"rows_between":2000,"halvings":0,"cell_chars":16384,"cell_head_chars":4096},"cells_cut":0,"cells_raw":0,"read":"whole","date_system":"1900"}

{"sheet":"Anleitung","index":0,"n_rows":23,"n_cols":1,"rows_kept":23,"cut":false,"hidden":false,"merged":[]}
["Die Tabellen Einzel-Meldung / Mannschaft-Meldung sowie LineThrow dienen zur automatischen Erfassung der Meldung mit dem Wettkampfprogramm"]
[]
["Bitte die Struktur der Tabelle nicht verändern,\nda sonst die Daten nicht automatisch gelesen werden können !!!"]
[]
["Zunächst in Tabelle Ansprechpartner-Meldung\nIm Feld C2/D2 den Bezirk auswählen:\n1. Feld mit der Maus markieren\n2. Auf Dropdown-Button (Pfeil) klicken und Bezirk auswählen"]
[]
["Danach Meldung der Teilnehmer auf den beiden Blättern eingeben.\nDie Erstplazierten und weitere Plazierte können direkt nacheinander eingegeben werden."]
[]
[]
["Altersklasse und bei Einzelteilnehmern die Angabe \nMannschaft Ja / Nein können ebenfalls über Dropdown-Buttons ausgewählt werden. "]
[]
[]
["Für Einzelteilnehmer der offen Altersklasse bitte zusätzlich die Meldezeiten der einzelnen Disziplinen in den Spalten J bis O eingeben.\nOhne Angabe einer Zeit wird der Teilnehmer bei der Laufeinteilung nicht berücksichtigt.\nBitte beachtet: Es müssen 3 oder 4 Disziplinen ausgewählt werden. \nBei falscher Anzahl der ausgewählten Disziplinen erscheint die Spalte S in rot.\n\nFalls keine Meldezeit vorliegt, bitte <9:59,99> eingeben."]
[]
["Für alle Felder mit beschränkten Eingaben werden die zulässigen Werte\nals Hilfe angezeigt, sobald das Feld markiert wird.\nBei unzulässiger Eingabe erfolgt eine Fehlermeldung.\n\nBeispiel:\n\nGeschlecht\nW: Weiblich\nM: Männlich"]
[]
["Die fertige Meldung spätestens zum Meldeschluß am 8.5.2023 als Excel-Datei per email senden an: \n\nwm@wuerttemberg.dlrg-jugend.de\n\nSie besteht aus folgenden Unterlagen:\n  Excel-Datei Meldeunterlagen_2023.xls mit den Tabellen: \n•  Ansprechpartner-Meldung\n•  Einzel-Meldung \n•  Mannschaft-Meldung\n• KR-Meldung\nsowie\n• Protokoll der Bezirksmeisterschaften"]
["Das Protokoll bitten wir einzuscannen und im PDF Format der email beizufügen.\n \nUm das Datenvolumen gering zu halten und die Zuordnung der Unterlagen zu erleichtern, bitten wir alle Dateien gezippt der email beizufügen und folgende Namenskonventionen für die Datei einzuhalten:\n \n• WM2023_Bezirk_Datum_Meldung.zip (ZIP-Datei)\n• WM2023_Bezirk_Datum_Meldung.xls (Excel-Datei Meldebogen)\n• WM2023_Bezirk_Datum_Protokoll.pdf (Excel-Datei)\n \nBei Bezirk bitte das übliche Gliederungskürzel verwenden, \nz. B. „ZAK“. Datum im Format JJMMTT.\n \n Bsp.: WM2020_ZAK_202ß0502_Meldung.xls\n\n Das Versenden eines schriftlichen Kontrollauszugs mit der Post an das LJS entfällt.\n Meldungen in Papierform werden nicht berücksichtigt."]
[]
["Bei Problemen mit der Excel-Datei bitte rechtzeitig vor Meldeschluß email an:\n wm@wuerttemberg.dlrg-jugend.de"]
[]
["Die anderen Tabellen bitte entsprechend der Überschriften vollständig mit allen vorgegebenen Feldern ausfüllen.\n\nEinzelne Zellen sind mit roten Dreiecken markiert.\nWenn die Maus auf diese bewegt wird, wird ein Hinweis zum jeweiligen Feld eingeblendet.\n"]
["Falls die Hilfe nicht sichtbar ist, solltet Ihr die Excel-Einstellung wie folgt anpassen:\n\nIm Menü Extras: Optionen auswählen.\nLasche Ansicht auswählen.\nUnter Kommentare: Nur Indikatoren bzw. Kommentare und Indikatoren auswählen.\nDann wird die Hilfe unter den roten Dreiecken sichtbar."]

{"sheet":"Ansprechpartner-Meldung","index":1,"n_rows":22,"n_cols":11,"rows_kept":22,"cut":false,"hidden":false,"merged":[[18,0,18,5],[13,0,13,5],[1,2,1,3],[0,6,2,7],[4,0,4,10],[8,0,8,5],[8,7,8,9]]}
["Meldebogen Württembergische Meisterschaften",null,null,null,"2023"]
["Bezirk",null,"Esslingen",null,{"$f":"VLOOKUP(C2,Listen!A2:B23,2,0)","v":"ES"}]
[]
[]
["Die Rechnung für unseren Bezirk bitte an folgende Anschrift senden:\nBitte nur eine verantwortliche Person, die die Rechnungen im Bezirk weiter bearbeitet, benennen\n"]
["Bezirk","Vorname","Name","email","Handy","Telefon","Fax","Straße\nHausnummer","PLZ Ort","Zuständig für WM\nJ: Jugend\nBZ: Bezirk","Funktion Im Bezirk"]
[{"$f":"E2","v":"ES"}]
[]
["Ansprechpartner für Rückfragen während der Zulassungssitzung \n\nBei offenen Punkten während der Zulassung wird die Kommission den genannten Handy-Anschluß anrufen.",null,null,null,null,null,null,"Kontrollsummen"]
["Bezirk","Vorname","Name","email","Handy","Telefon",null,"Einzel","Mannschaft","Linethrow"]
[{"$f":"E2","v":"ES"},null,null,null,null,null,null,{"$f":"COUNTA('Einzel-Meldung'!E2:E200)","v":0},{"$f":"COUNTA('Mannschaft-Meldung'!D2:D100)","v":0},{"$f":"COUNTA('LineThrow-Meldung'!E2:E100)","v":0}]
[{"$f":"E2","v":"ES"}]
[]
["Hauptansprechpartner im Bezirk in WM-Angelegenheiten"]
["Bezirk","Vorname","Name","email","Handy","Telefon"]
[{"$f":"E2","v":"ES"}]
[{"$f":"E2","v":"ES"}]
[]
["Ansprechpartner im Bezirk für das Nachrückverfahren"]
["Bezirk","Vorname","Name","email","Handy","Telefon"]
[{"$f":"E2","v":"ES"}]
[{"$f":"E2","v":"ES"}]

{"sheet":"Einzel-Meldung","index":2,"n_rows":200,"n_cols":17,"rows_kept":200,"cut":false,"hidden":false,"merged":[]}
["Q-GLD","Geschlecht","Altersklasse","Vorname","Nachname","Jahrgang","Platz","Punkte","Gliederung","200 m Hindernisschwimmen","100 m Retten mit Flossen und Gurtretter","50 m Retten einer Puppe","100 m Kombinierte Rettungs-übung","100 m Retten einer Puppe mit Flossen","200 m Super Lifesaver","Kontrolle AK 17/18 AK Offen Anz Disz","Kontroll-vermerk / Zulassung"]
[{"$f":"IF(E2<>\"\",'Ansprechpartner-Meldung'!$E$2,\"\")","v":""},null,null,null,null,null,null,null,null,null,null,null,null,null,null,{"$f":"IF(OR(C2=\"AK Offen\",C2=\"AK 17/18\",C2=\"AK 15/16\"),COUNT(J2:O2),\"\")","v":""}]
[{"$f":"IF(E3<>\"\",'Ansprechpartner-Meldung'!$E$2,\"\")","v":""},null,null,null,null,null,null,null,null,null,null,null,null,null,null,{"$f":"IF(OR(C3=\"AK Offen\",C3=\"AK 17/18\",C3=\"AK 15/16\"),COUNT(J3:O3),\"\")","v":""}]
[{"$f":"IF(E4<>\"\",'Ansprechpartner-Meldung'!$E$2,\"\")","v":""},null,null,null,null,null,null,null,null,null,null,null,null,null,null,""]
[{"$f":"IF(E5<>\"\",'Ansprechpartner-Meldung'!$E$2,\"\")","v":""},null,null,null,null,null,null,null,null,null,null,null,null,null,null,""]
[{"$f":"IF(E6<>\"\",'Ansprechpartner-Meldung'!$E$2,\"\")","v":""},null,null,null,null,null,null,null,null,null,null,null,null,null,null,""]
[{"$f":"IF(E7<>\"\",'Ansprechpartner-Meldung'!$E$2,\"\")","v":""},null,null,null,null,null,null,null,null,null,null,null,null,null,null,""]
[{"$f":"IF(E8<>\"\",'Ansprechpartner-Meldung'!$E$2,\"\")","v":""},null,null,null,null,null,null,null,null,null,null,null,null,null,null,""]
[{"$f":"IF(E9<>\"\",'Ansprechpartner-Meldung'!$E$2,\"\")","v":""},null,null,null,null,null,null,null,null,null,null,null,null,null,null,""]
[{"$f":"IF(E10<>\"\",'Ansprechpartner-Meldung'!$E$2,\"\")","v":""},null,null,null,null,null,null,null,null,null,null,null,null,null,null,""]
[{"$f":"IF(E11<>\"\",'Ansprechpartner-Meldung'!$E$2,\"\")","v":""},null,null,null,null,null,null,null,null,null,null,null,null,null,null,""]
[{"$f":"IF(E12<>\"\",'Ansprechpartner-Meldung'!$E$2,\"\")","v":""},null,null,null,null,null,null,null,null,null,null,null,null,null,null,""]
[{"$f":"IF(E13<>\"\",'Ansprechpartner-Meldung'!$E$2,\"\")","v":""},null,null,null,null,null,null,null,null,null,null,null,null,null,null,""]
[{"$f":"IF(E14<>\"\",'Ansprechpartner-Meldung'!$E$2,\"\")","v":""},null,null,null,null,null,null,null,null,null,null,null,null,null,null,""]
[{"$f":"IF(E15<>\"\",'Ansprechpartner-Meldung'!$E$2,\"\")","v":""},null,null,null,null,null,null,null,null,null,null,null,null,null,null,""]
[{"$f":"IF(E16<>\"\",'Ansprechpartner-Meldung'!$E$2,\"\")","v":""},null,null,null,null,null,null,null,null,null,null,null,null,null,null,""]
[{"$f":"IF(E17<>\"\",'Ansprechpartner-Meldung'!$E$2,\"\")","v":""},null,null,null,null,null,null,null,null,null,null,null,null,null,null,""]
[{"$f":"IF(E18<>\"\",'Ansprechpartner-Meldung'!$E$2,\"\")","v":""},null,null,null,null,null,null,null,null,null,null,null,null,null,null,""]
[{"$f":"IF(E19<>\"\",'Ansprechpartner-Meldung'!$E$2,\"\")","v":""},null,null,null,null,null,null,null,null,null,null,null,null,null,null,""]
[{"$f":"IF(E20<>\"\",'Ansprechpartner-Meldung'!$E$2,\"\")","v":""},null,null,null,null,null,null,null,null,null,null,null,null,null,null,""]
[{"$f":"IF(E21<>\"\",'Ansprechpartner-Meldung'!$E$2,\"\")","v":""},null,null,null,null,null,null,null,null,null,null,null,null,null,null,""]
[{"$f":"IF(E22<>\"\",'Ansprechpartner-Meldung'!$E$2,\"\")","v":""},null,null,null,null,null,null,null,null,null,null,null,null,null,null,""]
[{"$f":"IF(E23<>\"\",'Ansprechpartner-Meldung'!$E$2,\"\")","v":""},null,null,null,null,null,null,null,null,null,null,null,null,null,null,""]
[{"$f":"IF(E24<>\"\",'Ansprechpartner-Meldung'!$E$2,\"\")","v":""},null,null,null,null,null,null,null,null,null,null,null,null,null,null,""]
[{"$f":"IF(E25<>\"\",'Ansprechpartner-Meldung'!$E$2,\"\")","v":""},null,null,null,null,null,null,null,null,null,null,null,null,null,null,""]
[{"$f":"IF(E26<>\"\",'Ansprechpartner-Meldung'!$E$2,\"\")","v":""},null,null,null,null,null,null,null,null,null,null,null,null,null,null,""]
[{"$f":"IF(E27<>\"\",'Ansprechpartner-Meldung'!$E$2,\"\")","v":""},null,null,null,null,null,null,null,null,null,null,null,null,null,null,""]
[{"$f":"IF(E28<>\"\",'Ansprechpartner-Meldung'!$E$2,\"\")","v":""},null,null,null,null,null,null,null,null,null,null,null,null,null,null,""]
[{"$f":"IF(E29<>\"\",'Ansprechpartner-Meldung'!$E$2,\"\")","v":""},null,null,null,null,null,null,null,null,null,null,null,null,null,null,""]
[{"$f":"IF(E30<>\"\",'Ansprechpartner-Meldung'!$E$2,\"\")","v":""},null,null,null,null,null,null,null,null,null,null,null,null,null,null,""]
[{"$f":"IF(E31<>\"\",'Ansprechpartner-Meldung'!$E$2,\"\")","v":""},null,null,null,null,null,null,null,null,null,null,null,null,null,null,""]
[{"$f":"IF(E32<>\"\",'Ansprechpartner-Meldung'!$E$2,\"\")","v":""},null,null,null,null,null,null,null,null,null,null,null,null,null,null,""]
[{"$f":"IF(E33<>\"\",'Ansprechpartner-Meldung'!$E$2,\"\")","v":""},null,null,null,null,null,null,null,null,null,null,null,null,null,null,""]
[{"$f":"IF(E34<>\"\",'Ansprechpartner-Meldung'!$E$2,\"\")","v":""},null,null,null,null,null,null,null,null,null,null,null,null,null,null,""]
[{"$f":"IF(E35<>\"\",'Ansprechpartner-Meldung'!$E$2,\"\")","v":""},null,null,null,null,null,null,null,null,null,null,null,null,null,null,""]
[{"$f":"IF(E36<>\"\",'Ansprechpartner-Meldung'!$E$2,\"\")","v":""},null,null,null,null,null,null,null,null,null,null,null,null,null,null,""]
[{"$f":"IF(E37<>\"\",'Ansprechpartner-Meldung'!$E$2,\"\")","v":""},null,null,null,null,null,null,null,null,null,null,null,null,null,null,""]
[{"$f":"IF(E38<>\"\",'Ansprechpartner-Meldung'!$E$2,\"\")","v":""},null,null,null,null,null,null,null,null,null,null,null,null,null,null,""]
[{"$f":"IF(E39<>\"\",'Ansprechpartner-Meldung'!$E$2,\"\")","v":""},null,null,null,null,null,null,null,null,null,null,null,null,null,null,""]
[{"$f":"IF(E40<>\"\",'Ansprechpartner-Meldung'!$E$2,\"\")","v":""},null,null,null,null,null,null,null,null,null,null,null,null,null,null,""]
{"$rows_left_out":161}
{"sheet":"Mannschaft-Meldung","index":3,"n_rows":150,"n_cols":8,"rows_kept":150,"cut":false,"hidden":false,"merged":[]}
["Q-GLD","Geschlecht","Altersklasse","Name","Platz","Punkte","Gliederung","Kontroll-vermerk / Zulassung"]
[{"$f":"IF(D2<>\"\",'Ansprechpartner-Meldung'!$E$2,\"\")","v":""}]
[{"$f":"IF(D3<>\"\",'Ansprechpartner-Meldung'!$E$2,\"\")","v":""}]
[{"$f":"IF(D4<>\"\",'Ansprechpartner-Meldung'!$E$2,\"\")","v":""}]
[{"$f":"IF(D5<>\"\",'Ansprechpartner-Meldung'!$E$2,\"\")","v":""}]
[{"$f":"IF(D6<>\"\",'Ansprechpartner-Meldung'!$E$2,\"\")","v":""}]
[{"$f":"IF(D7<>\"\",'Ansprechpartner-Meldung'!$E$2,\"\")","v":""}]
[{"$f":"IF(D8<>\"\",'Ansprechpartner-Meldung'!$E$2,\"\")","v":""}]
[{"$f":"IF(D9<>\"\",'Ansprechpartner-Meldung'!$E$2,\"\")","v":""}]
[{"$f":"IF(D10<>\"\",'Ansprechpartner-Meldung'!$E$2,\"\")","v":""}]
[{"$f":"IF(D11<>\"\",'Ansprechpartner-Meldung'!$E$2,\"\")","v":""}]
[{"$f":"IF(D12<>\"\",'Ansprechpartner-Meldung'!$E$2,\"\")","v":""}]
[{"$f":"IF(D13<>\"\",'Ansprechpartner-Meldung'!$E$2,\"\")","v":""}]
[{"$f":"IF(D14<>\"\",'Ansprechpartner-Meldung'!$E$2,\"\")","v":""}]
[{"$f":"IF(D15<>\"\",'Ansprechpartner-Meldung'!$E$2,\"\")","v":""}]
[{"$f":"IF(D16<>\"\",'Ansprechpartner-Meldung'!$E$2,\"\")","v":""}]
[{"$f":"IF(D17<>\"\",'Ansprechpartner-Meldung'!$E$2,\"\")","v":""}]
[{"$f":"IF(D18<>\"\",'Ansprechpartner-Meldung'!$E$2,\"\")","v":""}]
[{"$f":"IF(D19<>\"\",'Ansprechpartner-Meldung'!$E$2,\"\")","v":""}]
[{"$f":"IF(D20<>\"\",'Ansprechpartner-Meldung'!$E$2,\"\")","v":""}]
[{"$f":"IF(D21<>\"\",'Ansprechpartner-Meldung'!$E$2,\"\")","v":""}]
[{"$f":"IF(D22<>\"\",'Ansprechpartner-Meldung'!$E$2,\"\")","v":""}]
[{"$f":"IF(D23<>\"\",'Ansprechpartner-Meldung'!$E$2,\"\")","v":""}]
[{"$f":"IF(D24<>\"\",'Ansprechpartner-Meldung'!$E$2,\"\")","v":""}]
[{"$f":"IF(D25<>\"\",'Ansprechpartner-Meldung'!$E$2,\"\")","v":""}]
[{"$f":"IF(D26<>\"\",'Ansprechpartner-Meldung'!$E$2,\"\")","v":""}]
[{"$f":"IF(D27<>\"\",'Ansprechpartner-Meldung'!$E$2,\"\")","v":""}]
[{"$f":"IF(D28<>\"\",'Ansprechpartner-Meldung'!$E$2,\"\")","v":""}]
[{"$f":"IF(D29<>\"\",'Ansprechpartner-Meldung'!$E$2,\"\")","v":""}]
[{"$f":"IF(D30<>\"\",'Ansprechpartner-Meldung'!$E$2,\"\")","v":""}]
[{"$f":"IF(D31<>\"\",'Ansprechpartner-Meldung'!$E$2,\"\")","v":""}]
[{"$f":"IF(D32<>\"\",'Ansprechpartner-Meldung'!$E$2,\"\")","v":""}]
[{"$f":"IF(D33<>\"\",'Ansprechpartner-Meldung'!$E$2,\"\")","v":""}]
[{"$f":"IF(D34<>\"\",'Ansprechpartner-Meldung'!$E$2,\"\")","v":""}]
[{"$f":"IF(D35<>\"\",'Ansprechpartner-Meldung'!$E$2,\"\")","v":""}]
[{"$f":"IF(D36<>\"\",'Ansprechpartner-Meldung'!$E$2,\"\")","v":""}]
[{"$f":"IF(D37<>\"\",'Ansprechpartner-Meldung'!$E$2,\"\")","v":""}]
[{"$f":"IF(D38<>\"\",'Ansprechpartner-Meldung'!$E$2,\"\")","v":""}]
[{"$f":"IF(D39<>\"\",'Ansprechpartner-Meldung'!$E$2,\"\")","v":""}]
[{"$f":"IF(D40<>\"\",'Ansprechpartner-Meldung'!$E$2,\"\")","v":""}]
{"$rows_left_out":111}
{"sheet":"LineThrow-Meldung","index":4,"n_rows":150,"n_cols":7,"rows_kept":150,"cut":false,"hidden":false,"merged":[]}
["Q-GLD","Geschlecht","Altersklasse","Name","Gliederung","Line Throw","Kontroll-vermerk / Zulassung"]
[{"$f":"IF(D2<>\"\",'Ansprechpartner-Meldung'!$E$2,\"\")","v":""},null,{"$f":"IF(A2<>\"\",\"Open\",\"\")","v":""}]
[{"$f":"IF(D3<>\"\",'Ansprechpartner-Meldung'!$E$2,\"\")","v":""},null,{"$f":"IF(A3<>\"\",\"Open\",\"\")","v":""}]
[{"$f":"IF(D4<>\"\",'Ansprechpartner-Meldung'!$E$2,\"\")","v":""},null,""]
[{"$f":"IF(D5<>\"\",'Ansprechpartner-Meldung'!$E$2,\"\")","v":""},null,""]
[{"$f":"IF(D6<>\"\",'Ansprechpartner-Meldung'!$E$2,\"\")","v":""},null,""]
[{"$f":"IF(D7<>\"\",'Ansprechpartner-Meldung'!$E$2,\"\")","v":""},null,""]
[{"$f":"IF(D8<>\"\",'Ansprechpartner-Meldung'!$E$2,\"\")","v":""},null,""]
[{"$f":"IF(D9<>\"\",'Ansprechpartner-Meldung'!$E$2,\"\")","v":""},null,""]
[{"$f":"IF(D10<>\"\",'Ansprechpartner-Meldung'!$E$2,\"\")","v":""},null,""]
[{"$f":"IF(D11<>\"\",'Ansprechpartner-Meldung'!$E$2,\"\")","v":""},null,""]
[{"$f":"IF(D12<>\"\",'Ansprechpartner-Meldung'!$E$2,\"\")","v":""},null,""]
[{"$f":"IF(D13<>\"\",'Ansprechpartner-Meldung'!$E$2,\"\")","v":""},null,""]
[{"$f":"IF(D14<>\"\",'Ansprechpartner-Meldung'!$E$2,\"\")","v":""},null,""]
[{"$f":"IF(D15<>\"\",'Ansprechpartner-Meldung'!$E$2,\"\")","v":""},null,""]
[{"$f":"IF(D16<>\"\",'Ansprechpartner-Meldung'!$E$2,\"\")","v":""},null,""]
[{"$f":"IF(D17<>\"\",'Ansprechpartner-Meldung'!$E$2,\"\")","v":""},null,""]
[{"$f":"IF(D18<>\"\",'Ansprechpartner-Meldung'!$E$2,\"\")","v":""},null,""]
[{"$f":"IF(D19<>\"\",'Ansprechpartner-Meldung'!$E$2,\"\")","v":""},null,""]
[{"$f":"IF(D20<>\"\",'Ansprechpartner-Meldung'!$E$2,\"\")","v":""},null,""]
[{"$f":"IF(D21<>\"\",'Ansprechpartner-Meldung'!$E$2,\"\")","v":""},null,""]
[{"$f":"IF(D22<>\"\",'Ansprechpartner-Meldung'!$E$2,\"\")","v":""},null,""]
[{"$f":"IF(D23<>\"\",'Ansprechpartner-Meldung'!$E$2,\"\")","v":""},null,""]
[{"$f":"IF(D24<>\"\",'Ansprechpartner-Meldung'!$E$2,\"\")","v":""},null,""]
[{"$f":"IF(D25<>\"\",'Ansprechpartner-Meldung'!$E$2,\"\")","v":""},null,""]
[{"$f":"IF(D26<>\"\",'Ansprechpartner-Meldung'!$E$2,\"\")","v":""},null,""]
[{"$f":"IF(D27<>\"\",'Ansprechpartner-Meldung'!$E$2,\"\")","v":""},null,""]
[{"$f":"IF(D28<>\"\",'Ansprechpartner-Meldung'!$E$2,\"\")","v":""},null,""]
[{"$f":"IF(D29<>\"\",'Ansprechpartner-Meldung'!$E$2,\"\")","v":""},null,""]
[{"$f":"IF(D30<>\"\",'Ansprechpartner-Meldung'!$E$2,\"\")","v":""},null,""]
[{"$f":"IF(D31<>\"\",'Ansprechpartner-Meldung'!$E$2,\"\")","v":""},null,""]
[{"$f":"IF(D32<>\"\",'Ansprechpartner-Meldung'!$E$2,\"\")","v":""},null,""]
[{"$f":"IF(D33<>\"\",'Ansprechpartner-Meldung'!$E$2,\"\")","v":""},null,""]
[{"$f":"IF(D34<>\"\",'Ansprechpartner-Meldung'!$E$2,\"\")","v":""},null,""]
[{"$f":"IF(D35<>\"\",'Ansprechpartner-Meldung'!$E$2,\"\")","v":""},null,""]
[{"$f":"IF(D36<>\"\",'Ansprechpartner-Meldung'!$E$2,\"\")","v":""},null,""]
[{"$f":"IF(D37<>\"\",'Ansprechpartner-Meldung'!$E$2,\"\")","v":""},null,""]
[{"$f":"IF(D38<>\"\",'Ansprechpartner-Meldung'!$E$2,\"\")","v":""},null,""]
[{"$f":"IF(D39<>\"\",'Ansprechpartner-Meldung'!$E$2,\"\")","v":""},null,""]
[{"$f":"IF(D40<>\"\",'Ansprechpartner-Meldung'!$E$2,\"\")","v":""},null,""]
{"$rows_left_out":111}
{"sheet":"KR-Meldung","index":5,"n_rows":19,"n_cols":12,"rows_kept":19,"cut":false,"hidden":false,"merged":[]}
["Intern","Bezirk","Vorname","Name","email","KR-Stufe","27.06.2023 Mannschaft","18.06.2023 Einzel","Verpflegung","Übernachtung Fr/Sa","Übernachtung Sa/So","Abendessen Samstag"]
[null,{"$f":"IF(C2<>\"\",'Ansprechpartner-Meldung'!$E$2,\"\")","v":"ES"},"Tom","Kater","tom@tomkater.de","D1","Ja","Ja","Fleisch","Ja","Ja","Ja"]
[null,{"$f":"IF(C3<>\"\",'Ansprechpartner-Meldung'!$E$2,\"\")","v":""}]
[null,{"$f":"IF(C4<>\"\",'Ansprechpartner-Meldung'!$E$2,\"\")","v":""}]
[null,{"$f":"IF(C5<>\"\",'Ansprechpartner-Meldung'!$E$2,\"\")","v":""}]
[null,{"$f":"IF(C6<>\"\",'Ansprechpartner-Meldung'!$E$2,\"\")","v":""}]
[null,{"$f":"IF(C7<>\"\",'Ansprechpartner-Meldung'!$E$2,\"\")","v":""}]
[null,{"$f":"IF(C8<>\"\",'Ansprechpartner-Meldung'!$E$2,\"\")","v":""}]
[null,{"$f":"IF(C9<>\"\",'Ansprechpartner-Meldung'!$E$2,\"\")","v":""}]
[null,{"$f":"IF(C10<>\"\",'Ansprechpartner-Meldung'!$E$2,\"\")","v":""}]
[null,{"$f":"IF(C11<>\"\",'Ansprechpartner-Meldung'!$E$2,\"\")","v":""}]
[null,{"$f":"IF(C12<>\"\",'Ansprechpartner-Meldung'!$E$2,\"\")","v":""}]
[null,{"$f":"IF(C13<>\"\",'Ansprechpartner-Meldung'!$E$2,\"\")","v":""}]
[null,{"$f":"IF(C14<>\"\",'Ansprechpartner-Meldung'!$E$2,\"\")","v":""}]
[null,{"$f":"IF(C15<>\"\",'Ansprechpartner-Meldung'!$E$2,\"\")","v":""}]
[null,{"$f":"IF(C16<>\"\",'Ansprechpartner-Meldung'!$E$2,\"\")","v":""}]
[null,{"$f":"IF(C17<>\"\",'Ansprechpartner-Meldung'!$E$2,\"\")","v":""}]
[null,{"$f":"IF(C18<>\"\",'Ansprechpartner-Meldung'!$E$2,\"\")","v":""}]
[null,{"$f":"IF(C19<>\"\",'Ansprechpartner-Meldung'!$E$2,\"\")","v":""}]

{"sheet":"Listen","index":6,"n_rows":23,"n_cols":8,"rows_kept":23,"cut":false,"hidden":true,"merged":[]}
["Bezirk","BZ Kürzel","Altersklasse","Wettkampf","Geschlecht","Essen","Stufe","Teilnahme "]
["Bodenseekreis","BOD","AK 10","E","M","Fleisch","F1","Ja"]
["Calw","CW","AK 12","M","W","Vegetarisch","E1","Nein"]
["Donau","DO","AK 13/14",null,null,"keine Verpflegung","D1"]
["Esslingen","ES","AK 15/16"]
["Federsee","FE","AK 17/18"]
["Fils","FI","AK Offen"]
["Freudenstadt","FDS"]
["Glems-Schönbuch","GS"]
["Heidenheim-Brenz","HDH"]
["Heilbronn","HN"]
["Hohenlohekreis","HL"]
["Ludwigsburg","LB"]
["Neckar-Donau","ND"]
["Ostalb","OA"]
["Ravensburg","RA"]
["Rems-Murr","RM"]
["Reutlingen","RT"]
["Schwäbisch-Hall","SHA"]
["Stuttgart","S"]
["Tauber","TA"]
["Tübingen","TÜ"]
["Zollernalb","ZO"]

{"sheet":"Historie","index":7,"n_rows":14,"n_cols":4,"rows_kept":14,"cut":false,"hidden":true,"merged":[]}
["Jahr","Version","Datum","Kommentar"]
[2006,1,"2006-05-03","Basisversion: alle Meldeformulare zusammengefaßt"]
[null,2,"2006-06-07","Korrektur: Eingabefelder Ordnermeldung entsperrt"]
[null,3,"2006-08-09","Korrektur: Formel Ordnerzahl nur auf Basis der Schwimmerzahlen, ohne Betreuer, Delegationsleiter"]
[2007,1,"2007-05-09","Basisversion"]
[2008,1,"2008-01-02","Basisversion"]
[2011,1,"2011-05-03","Basisversion Einzel AK17/18 Kontrolle Anzahl Disziplinen"]
[2012,1,"2012-06-20","Basisversion"]
[2012,1,"2012-07-11","Korrektur Drop down Einzelmeldung Start Mannschaft ja/nein"]
[2012,1,"2013-06-01","Basisversion"]
[2014,"0.1","2014-05-17","Basisversion"]
[2014,"1.0","2014-05-28","Version zur Veröffentlichung"]
[2015,"1.0","2015-04-27","Version zur Veröffentlichung"]
[2015,"1.1","2015-05-11","Änderung LV-Kürzel"]